[InterMine Dev] postprocessing error

julie at flymine.org julie at flymine.org
Wed Oct 12 17:07:13 BST 2011


The attribute "name" is misspelled in your project XML file:

 <post-process naem="summarise-objectstore"/>

It should be:

 <post-process name="summarise-objectstore"/>



> Hi,
> I used 0.98,
> I'm so sorry that I still don't understand how to deal with that error,
> can you say something details
>
> Thanks
> Su
> On 2011-10-12, at 下午7:00, dev-request at intermine.org wrote:
>
>> Send dev mailing list submissions to
>> 	dev at intermine.org
>>
>> To subscribe or unsubscribe via the World Wide Web, visit
>> 	http://mail.intermine.org/cgi-bin/mailman/listinfo/dev
>> or, via email, send a message with subject or body 'help' to
>> 	dev-request at intermine.org
>>
>> You can reach the person managing the list at
>> 	dev-owner at intermine.org
>>
>> When replying, please edit your Subject line so it is more specific
>> than "Re: Contents of dev digest..."
>>
>>
>> Today's Topics:
>>
>>   1. postprocessing error (wang su)
>>   2. Re: postprocessing error (Julie Sullivan)
>>
>>
>> ----------------------------------------------------------------------
>>
>> Message: 1
>> Date: Wed, 12 Oct 2011 16:19:32 +0800
>> From: wang su <wangsu0623 at gmail.com>
>> To: dev at intermine.org
>> Subject: [InterMine Dev] postprocessing error
>> Message-ID: <A2B93B10-7E6B-4CB9-8DD0-26FA7B7C3BD1 at gmail.com>
>> Content-Type: text/plain; charset=us-ascii
>>
>> Hi,
>>
>> When I run Post-processing in Mine_NAME/postprocess  ant
>> I have the following errors
>>
>> postprocess:
>> [postprocess]  executing post process: create-search-index
>> [postprocess] Performing postprocess: create-search-index
>> [postprocess] Creating lucene index for keyword search...
>> [postprocess]  executing post process: create-attribute-indexes
>> [postprocess] Performing postprocess: create-attribute-indexes
>> [postprocess]  executing post process: null
>> [postprocess] Performing postprocess: null
>>
>> BUILD FAILED
>> /mnt/Storage/home/wangs/dev/imbuild/postprocess.xml:31: error running
>> PostProcessTask (action: null)
>>
>> Total time: 1 minute 52 seconds
>>
>>
>> In my project.xml file, I define the postgres like
>>
>> <post-processing>
>>    <post-process name="create-references"/>
>>    <post-process name="create-chromosome-locations-and-lengths"/>
>>    <post-process name="transfer-sequences" dump="true"/>
>>    <post-process name="do-sources"/>
>>    <post-process name="create-search-index"/>
>>    <post-process name="create-attribute-indexes"/>
>>    <post-process naem="summarise-objectstore"/>
>>    <post-process name="create-autocomplete-index"/>
>>
>>  </post-processing>
>>
>> I didn't do anything with the file dev/imbuild/postprocess.xml, is this
>> caused the error? if so, how can I modify it
>>
>> Could you please help me to do with this error
>>
>> Thanks!
>>
>> Su
>>
>>
>> ------------------------------
>>
>> Message: 2
>> Date: Wed, 12 Oct 2011 09:22:41 +0100
>> From: Julie Sullivan <julie at flymine.org>
>> To: dev at intermine.org
>> Subject: Re: [InterMine Dev] postprocessing error
>> Message-ID: <4E954E51.2000604 at flymine.org>
>> Content-Type: text/plain; charset=ISO-8859-1; format=flowed
>>
>> it looks like it's failing on `summarise-objectstore`, can you remove
>> that one
>> entry and try again?
>>
>> Which branch are you using, 0.97 or 0.98?
>>
>> On 12/10/11 09:19, wang su wrote:
>>> Hi,
>>>
>>> When I run Post-processing in Mine_NAME/postprocess  ant
>>> I have the following errors
>>>
>>> postprocess:
>>> [postprocess]  executing post process: create-search-index
>>> [postprocess] Performing postprocess: create-search-index
>>> [postprocess] Creating lucene index for keyword search...
>>> [postprocess]  executing post process: create-attribute-indexes
>>> [postprocess] Performing postprocess: create-attribute-indexes
>>> [postprocess]  executing post process: null
>>> [postprocess] Performing postprocess: null
>>>
>>> BUILD FAILED
>>> /mnt/Storage/home/wangs/dev/imbuild/postprocess.xml:31: error running
>>> PostProcessTask (action: null)
>>>
>>> Total time: 1 minute 52 seconds
>>>
>>>
>>> In my project.xml file, I define the postgres like
>>>
>>> <post-processing>
>>>     <post-process name="create-references"/>
>>>     <post-process name="create-chromosome-locations-and-lengths"/>
>>>     <post-process name="transfer-sequences" dump="true"/>
>>>     <post-process name="do-sources"/>
>>>     <post-process name="create-search-index"/>
>>>     <post-process name="create-attribute-indexes"/>
>>>     <post-process naem="summarise-objectstore"/>
>>>     <post-process name="create-autocomplete-index"/>
>>>
>>>   </post-processing>
>>>
>>> I didn't do anything with the file dev/imbuild/postprocess.xml, is this
>>> caused the error? if so, how can I modify it
>>>
>>> Could you please help me to do with this error
>>>
>>> Thanks!
>>>
>>> Su
>>> _______________________________________________
>>> dev mailing list
>>> dev at intermine.org
>>> http://mail.intermine.org/cgi-bin/mailman/listinfo/dev
>>>
>>
>>
>>
>> ------------------------------
>>
>> _______________________________________________
>> dev mailing list
>> dev at intermine.org
>> http://mail.intermine.org/cgi-bin/mailman/listinfo/dev
>>
>>
>> End of dev Digest, Vol 29, Issue 9
>> **********************************
>
>
> _______________________________________________
> dev mailing list
> dev at intermine.org
> http://mail.intermine.org/cgi-bin/mailman/listinfo/dev
>




More information about the dev mailing list